{"text_format":"1","workbook":"xlsx","n_sheets":8,"sheets":["Systeem","SjabloonVoorblad","SjabloonWerkproces","KerntakenEnWerkprocessen","Beheersingsniveaus","Voorblad","B1-K2-W1","B1-K2-W2"],"not_rendered":{"charts":0,"images":0,"macros":1,"external_links":0,"defined_names":17,"comments":4,"pivot_tables":0},"unopened":[],"bounds":{"document_bytes":16777216,"sheet_cells":100000,"rows_first":2000,"rows_last":500,"rows_between":2000,"halvings":0,"cell_chars":16384,"cell_head_chars":4096},"cells_cut":0,"cells_raw":0,"read":"whole","date_system":"1900"}

{"sheet":"Systeem","index":0,"n_rows":19,"n_cols":3,"rows_kept":19,"cut":false,"hidden":true,"merged":[]}
[]
[null,"Ja/Nee"]
[null,"Ja"]
[null,"Nee"]
[]
[null,"Debug modus"]
[null,0,"Normale bedrijfsstand =  0"]
[]
[null,"Teksten"]
[null,"Werkproces motivatie:","Onderbouw altijd het beoordelingsresultaat.\nBij de onderbouwing kan gebruik gemaakt worden van de beschrijvingen in de beoordelingstabel.\n"]
[]
[null,"Fout markeer opmaak:"]
[]
[]
[null,"\"Grey-out\" opmaak:","greyed out"]
[]
[null,"Copyright tekst:","© Stichting Praktijkleren"]
[]
[null,"Regel afbreken werkprocesnaam:",45]

{"sheet":"SjabloonVoorblad","index":1,"n_rows":14,"n_cols":3,"rows_kept":14,"cut":false,"hidden":true,"merged":[[2,0,2,2],[13,1,13,2],[11,1,11,2],[0,0,0,2],[6,1,6,2],[7,1,7,2],[5,1,5,2],[9,1,9,2],[8,1,8,2]]}
["Beoordelingsformulier praktijkexamen"]
[]
["Algemene informatie"]
[]
["Code beoordelingsformulier en vaststellingsdatum",{"$f":"KerntakenEnWerkprocessen!B4","v":"BF_MBI_IS16-B1-K2_3"},{"$f":"KerntakenEnWerkprocessen!B3","v":"2016-04-27"}]
["Examenvorm",{"$f":"KerntakenEnWerkprocessen!C6","v":"Proeve van Bekwaamheid (praktijkexamen in de beroepspraktijk)"}]
["Examennaam",{"$f":"KerntakenEnWerkprocessen!B7","v":"[Examennaam]"}]
["Examencode",{"$f":"KerntakenEnWerkprocessen!C7","v":"[Examencode]"}]
["Profiel",{"$f":"KerntakenEnWerkprocessen!B9","v":"Medewerker ICT, 3"}]
["Kwalificatiedossier",{"$f":"KerntakenEnWerkprocessen!B8","v":"ICT Support"}]
["Cohort en crebocode",{"$f":"KerntakenEnWerkprocessen!C8","v":"2016 en verder"},{"$f":"KerntakenEnWerkprocessen!C9","v":25191}]
["Kerntaak",{"$f":"KerntakenEnWerkprocessen!C5","v":"Behandelen van incidentmeldingen"}]
[]
["Werkprocessen",{"$f":"KerntakenEnWerkprocessen!F2","v":"B1-K2-W1 In behandeling nemen en registreren van incidenten\nB1-K2-W2 Oplossen en/of escaleren van incidenten\n \n \n \n \n \n \n \n \n \n \n \n \n \n"}]

{"sheet":"SjabloonWerkproces","index":2,"n_rows":19,"n_cols":4,"rows_kept":19,"cut":false,"hidden":true,"merged":[[9,1,9,6],[10,1,10,6],[12,1,12,6]]}
["Werkproces:",null,{"$f":"VLOOKUP(B1,werkprocessen,2,FALSE)","v":{"$error":"#N/A"}}]
["Eerste opdracht:",{"$f":"VLOOKUP(B1,KerntakenEnWerkprocessen!B13:E27,3,FALSE)","v":{"$error":"#N/A"}}]
["Laatste opdracht:",{"$f":"VLOOKUP(B1,KerntakenEnWerkprocessen!B13:E27,4,FALSE)","v":{"$error":"#N/A"}}]
["PuntentotaalMax",{"$f":"SUM(N:N)","v":0},"Invullen gestart:",{"$f":"IF(SUM(O:O)>0,TRUE,FALSE)","v":false}]
["PuntentotaalBehaald",{"$f":"SUM(M:M)","v":0}]
["#Ant. Mog. <=1",{"$f":"COUNTIF(N:N,1)","v":0}]
["#Ant. Mog. 2-3",{"$f":"COUNTIF(N:N,2)+COUNTIF(N:N,3)","v":0}]
["Cesuur",{"$f":"0.5*B4","v":0}]
[]
[null,{"$f":"CONCATENATE(kerntaakCode,\": \",kerntaakNaam)","v":"B1-K2: Behandelen van incidentmeldingen"}]
[null,{"$f":"CONCATENATE(VLOOKUP(B1,werkprocessen,1,FALSE),\": \",C1)","v":{"$error":"#N/A"}}]
[]
[null,"Persoonsinformatie"]
[null,"Datum"]
[null,"Kandidaat"]
[null,"Leerlingnummer"]
[null,"Klas"]
[null,"Beoordelaar 1"]
[null,"Beoordelaar 2"]

{"sheet":"KerntakenEnWerkprocessen","index":3,"n_rows":29,"n_cols":6,"rows_kept":29,"cut":false,"hidden":true,"merged":[[3,1,3,2]]}
["Kerntaken en werkprocessen"]
[null,null,null,null,null,{"$f":"F27","v":"B1-K2-W1 In behandeling nemen en registreren van incidenten\nB1-K2-W2 Oplossen en/of escaleren van incidenten\n \n \n \n \n \n \n \n \n \n \n \n \n \n"}]
["Vaststellingsdatum","2016-04-27"]
["Code beoordelingsformulier","BF_MBI_IS16-B1-K2_3"]
["Kerntaak","B1-K2","Behandelen van incidentmeldingen"]
["Examenvorm",null,"Proeve van Bekwaamheid (praktijkexamen in de beroepspraktijk)"]
["Examennaam en Examencode","[Examennaam]","[Examencode]"]
["Kwalificatiedossier en Cohort","ICT Support","2016 en verder"]
["Profiel en crebocode","Medewerker ICT, 3",25191]
[]
[]
["Werkprocessen","Code","Naam","EersteOpdracht","LaatsteOpdracht","TekstSamengevoegd"]
[null,"B1-K2-W1","In behandeling nemen en registreren van incidenten",{"$f":"MIN(IF(Beheersingsniveaus!$A$4:$A$155=KerntakenEnWerkprocessen!$B13,Beheersingsniveaus!$B$4:$B$155))","v":1},{"$f":"MAX(IF(Beheersingsniveaus!$A$4:$A$155=KerntakenEnWerkprocessen!$B13,Beheersingsniveaus!$B$4:$B$155))","v":1},{"$f":"B13&\" \"&C13&CHAR(10)","v":"B1-K2-W1 In behandeling nemen en registreren van incidenten\n"}]
[null,"B1-K2-W2","Oplossen en/of escaleren van incidenten",{"$f":"MIN(IF(Beheersingsniveaus!$A$4:$A$155=KerntakenEnWerkprocessen!$B14,Beheersingsniveaus!$B$4:$B$155))","v":2},{"$f":"MAX(IF(Beheersingsniveaus!$A$4:$A$155=KerntakenEnWerkprocessen!$B14,Beheersingsniveaus!$B$4:$B$155))","v":2},{"$f":"F13&B14&\" \"&C14&CHAR(10)","v":"B1-K2-W1 In behandeling nemen en registreren van incidenten\nB1-K2-W2 Oplossen en/of escaleren van incidenten\n"}]
[null,null,null,{"$f":"MIN(IF(Beheersingsniveaus!$A$4:$A$155=KerntakenEnWerkprocessen!$B15,Beheersingsniveaus!$B$4:$B$155))","v":0},{"$f":"MAX(IF(Beheersingsniveaus!$A$4:$A$155=KerntakenEnWerkprocessen!$B15,Beheersingsniveaus!$B$4:$B$155))","v":0},{"$f":"F14&B15&\" \"&C15&CHAR(10)","v":"B1-K2-W1 In behandeling nemen en registreren van incidenten\nB1-K2-W2 Oplossen en/of escaleren van incidenten\n \n"}]
[null,null,null,{"$f":"MIN(IF(Beheersingsniveaus!$A$4:$A$155=KerntakenEnWerkprocessen!$B16,Beheersingsniveaus!$B$4:$B$155))","v":0},{"$f":"MAX(IF(Beheersingsniveaus!$A$4:$A$155=KerntakenEnWerkprocessen!$B16,Beheersingsniveaus!$B$4:$B$155))","v":0},"B1-K2-W1 In behandeling nemen en registreren van incidenten\nB1-K2-W2 Oplossen en/of escaleren van incidenten\n \n \n"]
[null,null,null,{"$f":"MIN(IF(Beheersingsniveaus!$A$4:$A$155=KerntakenEnWerkprocessen!$B17,Beheersingsniveaus!$B$4:$B$155))","v":0},{"$f":"MAX(IF(Beheersingsniveaus!$A$4:$A$155=KerntakenEnWerkprocessen!$B17,Beheersingsniveaus!$B$4:$B$155))","v":0},"B1-K2-W1 In behandeling nemen en registreren van incidenten\nB1-K2-W2 Oplossen en/of escaleren van incidenten\n \n \n \n"]
[null,null,null,{"$f":"MIN(IF(Beheersingsniveaus!$A$4:$A$155=KerntakenEnWerkprocessen!$B18,Beheersingsniveaus!$B$4:$B$155))","v":0},{"$f":"MAX(IF(Beheersingsniveaus!$A$4:$A$155=KerntakenEnWerkprocessen!$B18,Beheersingsniveaus!$B$4:$B$155))","v":0},"B1-K2-W1 In behandeling nemen en registreren van incidenten\nB1-K2-W2 Oplossen en/of escaleren van incidenten\n \n \n \n \n"]
[null,null,null,{"$f":"MIN(IF(Beheersingsniveaus!$A$4:$A$155=KerntakenEnWerkprocessen!$B19,Beheersingsniveaus!$B$4:$B$155))","v":0},{"$f":"MAX(IF(Beheersingsniveaus!$A$4:$A$155=KerntakenEnWerkprocessen!$B19,Beheersingsniveaus!$B$4:$B$155))","v":0},"B1-K2-W1 In behandeling nemen en registreren van incidenten\nB1-K2-W2 Oplossen en/of escaleren van incidenten\n \n \n \n \n \n"]
[null,null,null,{"$f":"MIN(IF(Beheersingsniveaus!$A$4:$A$155=KerntakenEnWerkprocessen!$B20,Beheersingsniveaus!$B$4:$B$155))","v":0},{"$f":"MAX(IF(Beheersingsniveaus!$A$4:$A$155=KerntakenEnWerkprocessen!$B20,Beheersingsniveaus!$B$4:$B$155))","v":0},"B1-K2-W1 In behandeling nemen en registreren van incidenten\nB1-K2-W2 Oplossen en/of escaleren van incidenten\n \n \n \n \n \n \n"]
{"$rows_left_out":10}
{"sheet":"Beheersingsniveaus","index":4,"n_rows":155,"n_cols":11,"rows_kept":155,"cut":false,"hidden":true,"merged":[]}
["Beschrijvingen beheersingsniveaus"]
[]
["Werkproces","Opdracht","OpdrachtId","CriteriumId","Taken","Criterium","Beheersingsniveau 0","Beheersingsniveau 1","Beheersingsniveau 2","Beheersingsniveau 3","Cruciaal"]
["B1-K2-W1",1,{"$f":"IF(A4<>\"\",CONCATENATE(A4,\"-\",B4),\"\")","v":"B1-K2-W1-1"},{"$f":"IF(C4<>\"\",CONCATENATE(C4,\"-\",\"1\"),\"\")","v":"B1-K2-W1-1-1"},"T1","Klantcontact","De houding is weinig tot niet klantvriendelijk en begripvol.","De houding is voor een klein deel klantvriendelijk en begripvol.","De houding is grotendeels klantvriendelijk en begripvol.\n","De houding is volledig klantvriendelijk en begripvol."]
["B1-K2-W1",1,{"$f":"IF(A5<>\"\",CONCATENATE(A5,\"-\",B5),\"\")","v":"B1-K2-W1-1"},{"$f":"IF(C5<>\"\",CONCATENATE(C5,\"-\",COUNTIF($C$4:C5,C5),\"\"),\"\")","v":"B1-K2-W1-1-2"},"T1","Communiceren\n(LSD-methode)","Er wordt niet of te weinig geluisterd, samengevat en doorgevraagd.\n","Er wordt weinig geluisterd, samengevat en doorgevraagd.","Er wordt overwegend geluisterd, samengevat en doorgevraagd.","Er wordt volledig geluisterd, samengevat en doorgevraagd."]
["B1-K2-W1",1,"B1-K2-W1-1",{"$f":"IF(C6<>\"\",CONCATENATE(C6,\"-\",COUNTIF($C$4:C6,C6),\"\"),\"\")","v":"B1-K2-W1-1-3"},"T1","Vaststellen probleem","Minder dan 80% van de problemen is vastgesteld.","Minimaal 80% van de problemen is vastgesteld.","Minimaal 90% van de problemen is vastgesteld.\n","Alle problemen zijn vastgesteld.","Ja"]
["B1-K2-W1",1,"B1-K2-W1-1",{"$f":"IF(C7<>\"\",CONCATENATE(C7,\"-\",COUNTIF($C$4:C7,C7),\"\"),\"\")","v":"B1-K2-W1-1-4"},"T1, T5","Taal Engels","De uitspraak van bekende woorden kan met enige inspanning worden verstaan. Woordgebruik en woordenschat (vaktaal Engels) worden onvoldoende toegepast. \n","De uitspraak is meestal duidelijk genoeg om verstaanbaar te zijn. Woordgebruik en woordenschat (vaktaal Engels) worden meestal toereikend toegepast. ","De uitspraak is duidelijk verstaanbaar. Woordgebruik en woordenschat (vaktaal Engels) worden meestal toereikend toegepast. ","De uitspraak is duidelijk verstaanbaar. Woordgebruik en woordenschat (vaktaal Engels) worden toereikend toegepast."]
["B1-K2-W1",1,"B1-K2-W1-1",{"$f":"IF(C8<>\"\",CONCATENATE(C8,\"-\",COUNTIF($C$4:C8,C8),\"\"),\"\")","v":"B1-K2-W1-1-5"},"T1, T5","Taal Nederlands","Stemt woordgebruik en vaktaal niet af op de doelgroep. Er worden vooral frequent voorkomende woorden en uitsluitend eenvoudige zinsconstructies gebruikt.","Stemt woordgebruik en vaktaal meestal af op de doelgroep. Past variatie in het woordgebruik meestal toe. Toont meestal een redelijke grammaticale beheersing.","Stemt woordgebruik en vaktaal op een enkel detail na af op de doelgroep. Past variatie in het woordgebruik toe. Toont op een enkel detail na een redelijke grammaticale beheersing.\n","Stemt woordgebruik en vaktaal af op de doelgroep. Past variatie in het woordgebruik toe. Toont een redelijke grammaticale beheersing."]
["B1-K2-W1",1,"B1-K2-W1-1",{"$f":"IF(C9<>\"\",CONCATENATE(C9,\"-\",COUNTIF($C$4:C9,C9),\"\"),\"\")","v":"B1-K2-W1-1-6"},"T2","Handelen conform bedrijfs-\nprocedures/SLA","Minder dan 80% van de meldingen wordt behandeld conform interne bedrijfsprocedures en/of SLA.","Minimaal 80% van de meldingen wordt behandeld conform interne bedrijfsprocedures en/of SLA.","Minimaal 90% van de meldingen wordt behandeld conform interne bedrijfsprocedures en/of SLA.\n","Alle meldingen worden behandeld conform interne bedrijfsprocedures en/of SLA.","Ja"]
["B1-K2-W1",1,"B1-K2-W1-1",{"$f":"IF(C10<>\"\",CONCATENATE(C10,\"-\",COUNTIF($C$4:C10,C10),\"\"),\"\")","v":"B1-K2-W1-1-7"},"T3","Categoriseren ","Minder dan 80% van de meldingen is juist gecategoriseerd.\n","Minimaal 80% van de meldingen is juist gecategoriseerd.","Minimaal 90% van de meldingen is juist gecategoriseerd.","Alle meldingen zijn juist gecategoriseerd."]
["B1-K2-W1",1,"B1-K2-W1-1",{"$f":"IF(C11<>\"\",CONCATENATE(C11,\"-\",COUNTIF($C$4:C11,C11),\"\"),\"\")","v":"B1-K2-W1-1-8"},"T3","Prioriteren","Minder dan 80% van de meldingen is juist geprioriteerd.\n","Minimaal 80% van de meldingen is juist geprioriteerd.","Minimaal 90% van de meldingen is juist geprioriteerd.","Alle meldingen zijn juist geprioriteerd."]
["B1-K2-W1",1,"B1-K2-W1-1",{"$f":"IF(C12<>\"\",CONCATENATE(C12,\"-\",COUNTIF($C$4:C12,C12),\"\"),\"\")","v":"B1-K2-W1-1-9"},"T3","Tijdsindicatie","Minder dan 80% van de meldingen is voorzien van een juiste tijdsindicatie.","Minimaal 80% van de meldingen is voorzien van een juiste tijdsindicatie.","Minimaal 90% van de meldingen is voorzien van een juiste tijdsindicatie.\n","Alle meldingen zijn voorzien van een juiste tijdsindicatie."]
["B1-K2-W1",1,"B1-K2-W1-1",{"$f":"IF(C13<>\"\",CONCATENATE(C13,\"-\",COUNTIF($C$4:C13,C13),\"\"),\"\")","v":"B1-K2-W1-1-10"},"T4","Doorzetten incidenten","Minder dan 80% van de meldingen is juist doorgezet, of de leidinggevende is geraadpleegd.","Minimaal 80% van de meldingen is juist doorgezet, of de leidinggevende is geraadpleegd.","Minimaal 90% van de meldingen is juist doorgezet, of de leidinggevende is geraadpleegd.\n","Alle meldingen zijn juist doorgezet, of de leidinggevende is geraadpleegd."]
["B1-K2-W1",1,{"$f":"IF(A14<>\"\",CONCATENATE(A14,\"-\",B14),\"\")","v":"B1-K2-W1-1"},{"$f":"IF(C14<>\"\",CONCATENATE(C14,\"-\",COUNTIF($C$4:C14,C14),\"\"),\"\")","v":"B1-K2-W1-1-11"},"T4","Initiatief tonen","Minder dan 80% van de melders is geïnformeerd over de voortgang van de melding.","Minimaal 80% van de melders is geïnformeerd over de voortgang van de melding.","Minimaal 90% van de melders is geïnformeerd over de voortgang van de melding.\n","Alle melders zijn geïnformeerd over de voortgang van de melding."]
["B1-K2-W1",1,"B1-K2-W1-1",{"$f":"IF(C15<>\"\",CONCATENATE(C15,\"-\",COUNTIF($C$4:C15,C15),\"\"),\"\")","v":"B1-K2-W1-1-12"},"T5","Informeren melders","Minder dan 80% van de melders is geïnformeerd over de voortgang van de melding.","Minimaal 80% van de melders is geïnformeerd over de voortgang van de melding.","Minimaal 90% van de melders is geïnformeerd over de voortgang van de melding.\n","Alle melders zijn geïnformeerd over de voortgang van de melding."]
["B1-K2-W1",1,"B1-K2-W1-1",{"$f":"IF(C16<>\"\",CONCATENATE(C16,\"-\",COUNTIF($C$4:C16,C16),\"\"),\"\")","v":"B1-K2-W1-1-13"},"T6","Documentatie","Minder dan 80% van de meldingen is voorzien van een juiste documentatie.\n","Minimaal 80% van de meldingen is voorzien van een juiste documentatie.","Minimaal 90% van de meldingen is voorzien van een juiste documentatie.","Alle meldingen zijn voorzien van een juiste documentatie."]
["B1-K2-W1",1,"B1-K2-W1-1",{"$f":"IF(C17<>\"\",CONCATENATE(C17,\"-\",COUNTIF($C$4:C17,C17),\"\"),\"\")","v":"B1-K2-W1-1-14"},"T6","Registratie","Minder dan 80% van de meldingen is voorzien van een juiste registratie.","Minimaal 80% van de meldingen is voorzien van een juiste registratie.","Minimaal 90% van de meldingen is voorzien van een juiste registratie.\n","Alle meldingen zijn voorzien van een juiste registratie.","Ja"]
["B1-K2-W1",1,"B1-K2-W1-1",{"$f":"IF(C18<>\"\",CONCATENATE(C18,\"-\",COUNTIF($C$4:C18,C18),\"\"),\"\")","v":"B1-K2-W1-1-15"},"T1 t/m T6","Werktempo","Er is in een te laag tempo gewerkt.\n","Er is in een passend tempo gewerkt."]
["B1-K2-W2",2,"B1-K2-W2-2",{"$f":"IF(C19<>\"\",CONCATENATE(C19,\"-\",COUNTIF($C$4:C19,C19),\"\"),\"\")","v":"B1-K2-W2-2-1"},"T1","Escaleren","Minder dan 80% van de meldingen is juist geëscaleerd. ","Minimaal 80% van de meldingen is juist geëscaleerd.","Minimaal 90% van de meldingen is juist geëscaleerd.\n","Alle meldingen zijn juist geëscaleerd.","Ja"]
["B1-K2-W2",2,"B1-K2-W2-2",{"$f":"IF(C20<>\"\",CONCATENATE(C20,\"-\",COUNTIF($C$4:C20,C20),\"\"),\"\")","v":"B1-K2-W2-2-2"},"T2","Oplossen meldingen","Minder dan 80% van de meldingen is juist opgelost.\n\nWaar een standaardoplossing niet voorhanden is, is de leidinggevende niet geraadpleegd.","Minimaal 80% van de meldingen is juist opgelost.\n\nWaar een standaardoplossing niet voorhanden is, is de leidinggevende niet geraadpleegd.","Minimaal 90% van de meldingen is juist opgelost.\n\nWaar een standaardoplossing niet voorhanden is, is de leidinggevende geraadpleegd.\n","Alle meldingen zijn juist opgelost.\n\nWaar een standaardoplossing niet voorhanden is, is de leidinggevende geraadpleegd.","Ja"]
{"$rows_left_out":136}
{"sheet":"Voorblad","index":5,"n_rows":14,"n_cols":3,"rows_kept":14,"cut":false,"hidden":false,"merged":[[9,1,9,2],[11,1,11,2],[13,1,13,2],[0,0,0,2],[2,0,2,2],[5,1,5,2],[6,1,6,2],[7,1,7,2],[8,1,8,2]]}
["Beoordelingsformulier praktijkexamen"]
[]
["Algemene informatie"]
[]
["Code beoordelingsformulier en vaststellingsdatum",{"$f":"KerntakenEnWerkprocessen!B4","v":"BF_MBI_IS16-B1-K2_3"},{"$f":"KerntakenEnWerkprocessen!B3","v":"2016-04-27"}]
["Examenvorm",{"$f":"KerntakenEnWerkprocessen!C6","v":"Proeve van Bekwaamheid (praktijkexamen in de beroepspraktijk)"}]
["Examennaam",{"$f":"KerntakenEnWerkprocessen!B7","v":"[Examennaam]"}]
["Examencode",{"$f":"KerntakenEnWerkprocessen!C7","v":"[Examencode]"}]
["Profiel",{"$f":"KerntakenEnWerkprocessen!B9","v":"Medewerker ICT, 3"}]
["Kwalificatiedossier",{"$f":"KerntakenEnWerkprocessen!B8","v":"ICT Support"}]
["Cohort en crebocode",{"$f":"KerntakenEnWerkprocessen!C8","v":"2016 en verder"},{"$f":"KerntakenEnWerkprocessen!C9","v":25191}]
["Kerntaak",{"$f":"KerntakenEnWerkprocessen!C5","v":"Behandelen van incidentmeldingen"}]
[]
["Werkprocessen",{"$f":"KerntakenEnWerkprocessen!F2","v":"B1-K2-W1 In behandeling nemen en registreren van incidenten\nB1-K2-W2 Oplossen en/of escaleren van incidenten\n \n \n \n \n \n \n \n \n \n \n \n \n \n"}]

{"sheet":"B1-K2-W1","index":6,"n_rows":108,"n_cols":15,"rows_kept":108,"cut":false,"hidden":false,"merged":[[102,1,102,6],[106,2,106,3],[107,2,107,3],[9,1,9,6],[10,1,10,6],[12,1,12,6],[20,1,20,6],[39,1,39,6],[101,1,101,6]]}
["Werkproces:","B1-K2-W1",{"$f":"VLOOKUP(B1,werkprocessen,2,FALSE)","v":"In behandeling nemen en registreren van incidenten"}]
["Eerste opdracht:",{"$f":"VLOOKUP(B1,KerntakenEnWerkprocessen!B13:E27,3,FALSE)","v":1}]
["Laatste opdracht:",{"$f":"VLOOKUP(B1,KerntakenEnWerkprocessen!B13:E27,4,FALSE)","v":1}]
["PuntentotaalMax",{"$f":"SUM(N:N)","v":43},"Invullen gestart:",{"$f":"IF(SUM(O:O)>0,TRUE,FALSE)","v":false}]
["PuntentotaalBehaald",{"$f":"SUM(M:M)","v":0}]
["#Ant. Mog. <=1",{"$f":"COUNTIF(N:N,1)","v":1}]
["#Ant. Mog. 2-3",{"$f":"COUNTIF(N:N,2)+COUNTIF(N:N,3)","v":14}]
["Cesuur",{"$f":"0.5*B4","v":21.5}]
[]
[null,{"$f":"CONCATENATE(kerntaakCode,\": \",kerntaakNaam)","v":"B1-K2: Behandelen van incidentmeldingen"}]
[null,{"$f":"CONCATENATE(VLOOKUP(B1,werkprocessen,1,FALSE),\": \",C1)","v":"B1-K2-W1: In behandeling nemen en registreren van incidenten"}]
[]
[null,"Persoonsinformatie"]
[null,"Datum"]
[null,"Kandidaat"]
[null,"Leerlingnummer"]
[null,"Klas"]
[null,"Beoordelaar 1"]
[null,"Beoordelaar 2"]
[]
{"$rows_left_out":89}
{"sheet":"B1-K2-W2","index":7,"n_rows":81,"n_cols":15,"rows_kept":81,"cut":false,"hidden":false,"merged":[[75,1,75,6],[79,2,79,3],[80,2,80,3],[9,1,9,6],[10,1,10,6],[12,1,12,6],[20,1,20,6],[33,1,33,6],[74,1,74,6]]}
["Werkproces:","B1-K2-W2",{"$f":"VLOOKUP(B1,werkprocessen,2,FALSE)","v":"Oplossen en/of escaleren van incidenten"}]
["Eerste opdracht:",{"$f":"VLOOKUP(B1,KerntakenEnWerkprocessen!B13:E27,3,FALSE)","v":2}]
["Laatste opdracht:",{"$f":"VLOOKUP(B1,KerntakenEnWerkprocessen!B13:E27,4,FALSE)","v":2}]
["PuntentotaalMax",{"$f":"SUM(N:N)","v":23},"Invullen gestart:",{"$f":"IF(SUM(O:O)>0,TRUE,FALSE)","v":false}]
["PuntentotaalBehaald",{"$f":"SUM(M:M)","v":0}]
["#Ant. Mog. <=1",{"$f":"COUNTIF(N:N,1)","v":2}]
["#Ant. Mog. 2-3",{"$f":"COUNTIF(N:N,2)+COUNTIF(N:N,3)","v":7}]
["Cesuur",{"$f":"0.5*B4","v":11.5}]
[]
[null,{"$f":"CONCATENATE(kerntaakCode,\": \",kerntaakNaam)","v":"B1-K2: Behandelen van incidentmeldingen"}]
[null,{"$f":"CONCATENATE(VLOOKUP(B1,werkprocessen,1,FALSE),\": \",C1)","v":"B1-K2-W2: Oplossen en/of escaleren van incidenten"}]
[]
[null,"Persoonsinformatie"]
[null,"Datum"]
[null,"Kandidaat"]
[null,"Leerlingnummer"]
[null,"Klas"]
[null,"Beoordelaar 1"]
[null,"Beoordelaar 2"]
[]
{"$rows_left_out":61}